Target
Sodium-dependent serotonin transporter
Ligand
BDBM50102006
Substrate
Meas. Tech.
ChEBML_201982
Ki
0.100000±n/a nM
Citation
 Meagher, KLMewshaw, REEvrard, DAZhou, PSmith, DLScerni, RSpangler, TAbulhawa, SShi, XSchechter, LEAndree, TH Studies towards the next generation of antidepressants. Part 1: Indolylcyclohexylamines as potent serotonin reuptake inhibitors. Bioorg Med Chem Lett 11:1885-8 (2001)  
Target
Name:
Sodium-dependent serotonin transporter
Synonyms:
5-HT Transporter 5HT transporter Anandamid membrane transporter, AMT Monoamine transporters; Norepinephrine & serotonin Slc6a4 Sodium-dependent serotonin transporter (SERT) | imipramine receptor
Type:
Multi-pass membrane protein
Mol. Mass.:
70168.43
Organism:
Rattus norvegicus (rat)
Description:
P31652
Residue:
630
  
Inhibitor
Name:
BDBM50102006
Synonyms:
3-[4-(6-Methoxy-3,4-dihydro-1H-isoquinolin-2-yl)-cyclohexyl]-1H-indole-5-carbonitrile cis-3-(4-(6-methoxy-3,4-dihydroisoquinolin-2(1H)-yl)cyclohexyl)-1H-indole-5-carbonitrile
Type:
Small organic molecule
Emp. Form.:
C25H27N3O
Mol. Mass.:
385.5014
SMILES:
COc1ccc2CN(CCc2c1)[C@H]1CC[C@H](CC1)c1c[nH]c2ccc(cc12)C#N
: