Target
Alpha-1B adrenergic receptor
Ligand
BDBM50102242
Substrate
Meas. Tech.
ChEBML_34460
Ki
>2000±n/a nM
Citation
 DiPardo, RMPatane, MANewton, RCPrice, RBroten, TPChang, RSRansom, RWDi Salvo, JFreidinger, RMBock, MG Cyclic imides as potent and selective alpha-1A adrenergic receptor antagonists. Bioorg Med Chem Lett 11:1959-62 (2001)  
Target
Name:
Alpha-1B adrenergic receptor
Synonyms:
ADA1B_HUMAN Adrenergic alpha1B Adrenergic receptor alpha Alpha 1B-adrenoreceptor | Alpha-1B adrenergic receptor
Type:
Enzyme
Mol. Mass.:
56862.13
Organism:
Homo sapiens (Human)
Description:
P35368
Residue:
520
  
Inhibitor
Name:
BDBM50102242
Synonyms:
1-[3-(2,4-Dioxo-5,5-di-p-tolyl-oxazolidin-3-yl)-propyl]-4-o-tolyl-piperidine-4-carbonitrile | CHEMBL301416
Type:
Small organic molecule
Emp. Form.:
C33H35N3O3
Mol. Mass.:
521.6493
SMILES:
Cc1ccc(cc1)C1(OC(=O)N(CCCN2CCC(CC2)(C#N)c2ccccc2C)C1=O)c1ccc(C)cc1
: