Target
P2X purinoceptor 4
Ligand
BDBM85043
Substrate
Meas. Tech.
ChEMBL_147556 (CHEMBL751126)
IC50
2600±n/a nM
Citation
 Kim, YCBrown, SGHarden, TKBoyer, JLDubyak, GKing, BFBurnstock, GJacobson, KA Structure-activity relationships of pyridoxal phosphate derivatives as potent and selective antagonists of P2X1 receptors. J Med Chem 44:340-9 (2001)  
Target
Name:
P2X purinoceptor 4
Synonyms:
P2RX4_RAT Purinergic, P2X4
Type:
Enzyme Catalytic Domain
Mol. Mass.:
43504.16
Organism:
RAT
Description:
Purinergic, P2X4 0 RAT::P51577
Residue:
388
  
Inhibitor
Name:
BDBM85043
Synonyms:
CAS_149017-66-3 NSC_6093163 | PPADS
Type:
Small organic molecule
Emp. Form.:
C14H14N3O12PS2
Mol. Mass.:
511.378
SMILES:
Cc1nc(N=Nc2ccc(cc2S(O)(=O)=O)S(O)(=O)=O)c(COP(O)(O)=O)c(C=O)c1O
: