Target
D(2) dopamine receptor
Ligand
BDBM50102314
Substrate
Meas. Tech.
ChEMBL_61606 (CHEMBL675928)
IC50
755±n/a nM
Citation
 Warawa, EJMigler, BMOhnmacht, CJNeedles, ALGatos, GCMcLaren, FMNelson, CLKirkland, KM Behavioral approach to nondyskinetic dopamine antagonists: identification of seroquel. J Med Chem 44:372-89 (2001)  
Target
Name:
D(2) dopamine receptor
Synonyms:
DOPAMINE D2 DOPAMINE D2 Short Dopamine D2 receptor Drd2
Type:
G Protein-Coupled Receptor (GPCR)
Mol. Mass.:
50931.60
Organism:
Rattus norvegicus (rat)
Description:
P61169
Residue:
444
  
Inhibitor
Name:
BDBM50102314
Synonyms:
3-(4-Dibenzo[b,f][1,4]thiazepin-11-yl-piperazin-1-yl)-2-methoxy-propan-1-ol | CHEMBL339889
Type:
Small organic molecule
Emp. Form.:
C21H25N3O2S
Mol. Mass.:
383.507
SMILES:
COC(CO)CN1CCN(CC1)C1=Nc2ccccc2Sc2ccccc12
: