Target
D(2) dopamine receptor
Ligand
BDBM50102316
Substrate
Meas. Tech.
ChEMBL_61606 (CHEMBL675928)
IC50
1394±n/a nM
Citation
 Warawa, EJMigler, BMOhnmacht, CJNeedles, ALGatos, GCMcLaren, FMNelson, CLKirkland, KM Behavioral approach to nondyskinetic dopamine antagonists: identification of seroquel. J Med Chem 44:372-89 (2001)  
Target
Name:
D(2) dopamine receptor
Synonyms:
DOPAMINE D2 DOPAMINE D2 Short Dopamine D2 receptor Drd2
Type:
G Protein-Coupled Receptor (GPCR)
Mol. Mass.:
50931.60
Organism:
Rattus norvegicus (rat)
Description:
P61169
Residue:
444
  
Inhibitor
Name:
BDBM50102316
Synonyms:
2-{2-[2-(4-Dibenzo[b,f][1,4]thiazepin-11-yl-piperazin-1-yl)-ethoxy]-ethoxy}-ethanol | CHEMBL341098
Type:
Small organic molecule
Emp. Form.:
C23H29N3O3S
Mol. Mass.:
427.56
SMILES:
OCCOCCOCCN1CCN(CC1)C1=Nc2ccccc2Sc2ccccc12
: