Target
D(2) dopamine receptor
Ligand
BDBM50102321
Substrate
Meas. Tech.
ChEMBL_61606 (CHEMBL675928)
IC50
417±n/a nM
Citation
 Warawa, EJMigler, BMOhnmacht, CJNeedles, ALGatos, GCMcLaren, FMNelson, CLKirkland, KM Behavioral approach to nondyskinetic dopamine antagonists: identification of seroquel. J Med Chem 44:372-89 (2001)  
Target
Name:
D(2) dopamine receptor
Synonyms:
DOPAMINE D2 DOPAMINE D2 Short Dopamine D2 receptor Drd2
Type:
G Protein-Coupled Receptor (GPCR)
Mol. Mass.:
50931.60
Organism:
Rattus norvegicus (rat)
Description:
P61169
Residue:
444
  
Inhibitor
Name:
BDBM50102321
Synonyms:
11-[4-(Tetrahydro-furan-2-ylmethyl)-piperazin-1-yl]-dibenzo[b,f][1,4]thiazepine | CHEMBL126658
Type:
Small organic molecule
Emp. Form.:
C22H25N3OS
Mol. Mass.:
379.518
SMILES:
C(C1CCCO1)N1CCN(CC1)C1=Nc2ccccc2Sc2ccccc12
: