Target
D(2) dopamine receptor
Ligand
BDBM50102323
Substrate
Meas. Tech.
ChEMBL_61606 (CHEMBL675928)
IC50
560±n/a nM
Citation
 Warawa, EJMigler, BMOhnmacht, CJNeedles, ALGatos, GCMcLaren, FMNelson, CLKirkland, KM Behavioral approach to nondyskinetic dopamine antagonists: identification of seroquel. J Med Chem 44:372-89 (2001)  
Target
Name:
D(2) dopamine receptor
Synonyms:
DOPAMINE D2 DOPAMINE D2 Short Dopamine D2 receptor Drd2
Type:
G Protein-Coupled Receptor (GPCR)
Mol. Mass.:
50931.60
Organism:
Rattus norvegicus (rat)
Description:
P61169
Residue:
444
  
Inhibitor
Name:
BDBM50102323
Synonyms:
2-{2-[4-(7-Fluoro-dibenzo[b,f][1,4]thiazepin-11-yl)-piperazin-1-yl]-ethoxy}-ethanol | CHEMBL340225
Type:
Small organic molecule
Emp. Form.:
C21H24FN3O2S
Mol. Mass.:
401.498
SMILES:
OCCOCCN1CCN(CC1)C1=Nc2ccc(F)cc2Sc2ccccc12
: