Target
5-hydroxytryptamine receptor 1A
Ligand
BDBM50102412
Substrate
Meas. Tech.
ChEMBL_1160 (CHEMBL616105)
Ki
12±n/a nM
Citation
 Martínez-Esparza, JOficialdegui, AMPérez-Silanes, SHeras, BOrús, LPalop, JALasheras, BRoca, JMourelle, MBosch, ADel Castillo, JCTordera, RDel Río, JMonge, A New 1-aryl-3-(4-arylpiperazin-1-yl)propane derivatives, with dual action at 5-HT1A serotonin receptors and serotonin transporter, as a new class of antidepressants. J Med Chem 44:418-28 (2001)  
Target
Name:
5-hydroxytryptamine receptor 1A
Synonyms:
5-HT-1A 5-HT1A 5-hydroxytryptamine receptor 1A (5HT1A) 5ht1a Htr1a Serotonin 1a (5-HT1a) receptor/Adrenergic receptor alpha-1 | Serotonin receptor 1A
Type:
G Protein-Coupled Receptor (GPCR)
Mol. Mass.:
46445.29
Organism:
Rattus norvegicus (rat)
Description:
Binding assays were performed using rat hippocampal membranes.
Residue:
422
  
Inhibitor
Name:
BDBM50102412
Synonyms:
1-(2,5-Dimethyl-thiophen-3-yl)-3-[4-(2-methoxy-phenyl)-piperazin-1-yl]-propan-1-ol CHEMBL334407
Type:
Small organic molecule
Emp. Form.:
C20H28N2O2S
Mol. Mass.:
360.514
SMILES:
COc1ccccc1N1CCN(CCC(O)c2cc(C)sc2C)CC1
: