Target
Epidermal growth factor receptor
Ligand
BDBM50102417
Substrate
Meas. Tech.
ChEMBL_66895 (CHEMBL675519)
IC50
300000±n/a nM
Citation
 Mu, FCoffing, SLRiese, DJGeahlen, RLVerdier-Pinard, PHamel, TEJohnson, JCushman, M Design, synthesis, and biological evaluation of a series of lavendustin A analogues that inhibit EGFR and Syk tyrosine kinases, as well as tubulin polymerization. J Med Chem 44:441-52 (2001)  
Target
Name:
Epidermal growth factor receptor
Synonyms:
EGFR_MOUSE Epidermal growth factor receptor erbB1
Type:
PROTEIN
Mol. Mass.:
134859.02
Organism:
Mus musculus
Description:
ChEMBL_305656
Residue:
1210
  
Inhibitor
Name:
BDBM50102417
Synonyms:
5-(2,5-Dihydroxy-benzylamino)-2-hydroxy-N-[2-(4-hydroxy-phenyl)-ethyl]-benzamide | CHEMBL141271
Type:
Small organic molecule
Emp. Form.:
C22H22N2O5
Mol. Mass.:
394.4205
SMILES:
Oc1ccc(CCNC(=O)c2cc(NCc3cc(O)ccc3O)ccc2O)cc1
: