Target
Sodium- and chloride-dependent glycine transporter 1
Ligand
BDBM50102692
Substrate
Meas. Tech.
ChEMBL_70973 (CHEMBL680552)
IC50
>100±n/a nM
Citation
 Caulfield, WLCollie, ITDickins, RSEpemolu, OMcGuire, RHill, DRMcVey, GMorphy, JRRankovic, ZSundaram, H The first potent and selective inhibitors of the glycine transporter type 2. J Med Chem 44:2679-82 (2001)  
Target
Name:
Sodium- and chloride-dependent glycine transporter 1
Synonyms:
GlyT-1 Glycine Transporters (GlyT1c) SC6A9_HUMAN Sodium- and chloride-dependent glycine transporter 1 Sodium- and chloride-dependent glycine transporter 1 (GlyT1c) Solute carrier family 6 member 9
Type:
Enzyme
Mol. Mass.:
78270.54
Organism:
Homo sapiens (Human)
Description:
P48067
Residue:
706
  
Inhibitor
Name:
BDBM50102692
Synonyms:
4-Benzyloxy-N-(1-dimethylamino-cyclopentylmethyl)-3,5-dimethoxy-benzamide CHEMBL88588 | ORG-25543
Type:
Small organic molecule
Emp. Form.:
C24H32N2O4
Mol. Mass.:
412.5219
SMILES:
COc1cc(cc(OC)c1OCc1ccccc1)C(=O)NCC1(CCCC1)N(C)C
: