Target
Coagulation factor X
Ligand
BDBM50102777
Substrate
Meas. Tech.
ChEMBL_48667 (CHEMBL658338)
Ki
6800±n/a nM
Citation
 Verner, EKatz, BASpencer, JRAllen, DHataye, JHruzewicz, WHui, HCKolesnikov, ALi, YLuong, CMartelli, ARadika, KRai, RShe, MShrader, WSprengeler, PATrapp, SWang, JYoung, WBMackman, RL Development of serine protease inhibitors displaying a multicentered short (<2.3 A) hydrogen bond binding mode: inhibitors of urokinase-type plasminogen activator and factor Xa. J Med Chem 44:2753-71 (2001)  
Target
Name:
Coagulation factor X
Synonyms:
Activated coagulation factor X (FXa) Coagulation factor X precursor F10 Factor X heavy chain Factor Xa Stuart-Prower factor
Type:
Enzyme
Mol. Mass.:
54726.60
Organism:
Homo sapiens (Human)
Description:
Residue:
488
  
Inhibitor
Name:
BDBM50102777
Synonyms:
2-(5-Fluoro-2-hydroxy-phenyl)-1H-benzoimidazole-5-carboxamidine CHEMBL92277
Type:
Small organic molecule
Emp. Form.:
C14H11FN4O
Mol. Mass.:
270.2617
SMILES:
NC(=N)c1ccc2nc([nH]c2c1)-c1cc(F)ccc1O
: