Target
Interstitial collagenase
Ligand
BDBM50103101
Substrate
Meas. Tech.
ChEBML_105944
Ki
55±n/a nM
Citation
 Musso, DLAndersen, MWAndrews, RCAustin, RBeaudet, EJBecherer, JDBubacz, DGBickett, DMChan, JHConway, JGCowan, DJGaul, MDGlennon, KCHedeen, KMLambert, MHLeesnitzer, MAMcDougald, DLMitchell, JLMoss, MLRabinowitz, MHRizzolio, MCSchaller, LTStanford, JBTippin, TWarner, JRWhitesell, LGWiethe, RW N-hydroxyformamide peptidomimetics as TACE/matrix metalloprotease inhibitors: oral activity via P1' isobutyl substitution. Bioorg Med Chem Lett 11:2147-51 (2001)  
Target
Name:
Interstitial collagenase
Synonyms:
CLG MMP1 Matrix metalloproteinase-1 | Matrix metalloproteinase-1 (MMP-1)
Type:
Enzyme
Mol. Mass.:
54010.26
Organism:
Homo sapiens (Human)
Description:
P03956
Residue:
469
  
Inhibitor
Name:
BDBM50103101
Synonyms:
(2R,3S)-3-(Formyl-hydroxy-amino)-2-isobutyl-pentanoic acid [(S)-2-methyl-1-(pyridin-2-ylcarbamoyl)-butyl]-amide | CHEMBL68667
Type:
Small organic molecule
Emp. Form.:
C21H34N4O4
Mol. Mass.:
406.5191
SMILES:
CCC(C)[C@H](NC(=O)[C@H](CC(C)C)[C@H](CC)N(O)C=O)C(=O)Nc1ccccn1
: