Target
Glucocorticoid receptor
Ligand
BDBM50103254
Substrate
Meas. Tech.
ChEMBL_71405 (CHEMBL680191)
Ki
2.4±n/a nM
Citation
 Coghlan, MJKym, PRElmore, SWWang, AXLuly, JRWilcox, DStashko, MLin, CWMiner, JTyree, CNakane, MJacobson, PLane, BC Synthesis and characterization of non-steroidal ligands for the glucocorticoid receptor: selective quinoline derivatives with prednisolone-equivalent functional activity. J Med Chem 44:2879-85 (2001)  
Target
Name:
Glucocorticoid receptor
Synonyms:
GCR_HUMAN GRL Glucocorticoid receptor (GRFP) Nuclear receptor subfamily 3 group C member 1
Type:
Enzyme
Mol. Mass.:
85656.87
Organism:
Homo sapiens (Human)
Description:
P04150
Residue:
777
  
Inhibitor
Name:
BDBM50103254
Synonyms:
CHEMBL317578 | Dimethyl-carbamic acid 3-(10-methoxy-2,2,4-trimethyl-2,5-dihydro-1H-6-oxa-1-aza-chrysen-5-yl)-phenyl ester
Type:
Small organic molecule
Emp. Form.:
C29H30N2O4
Mol. Mass.:
470.5595
SMILES:
COc1cccc2OC(c3cccc(OC(=O)N(C)C)c3)c3c(ccc4NC(C)(C)C=C(C)c34)-c12
: