Target
Protein farnesyltransferase subunit beta/geranylgeranyltransferase type-1 subunit alpha
Ligand
BDBM50103262
Substrate
Meas. Tech.
ChEMBL_70755 (CHEMBL682842)
IC50
105±n/a nM
Citation
 Sakowski, JBöhm, MSattler, IDahse, HMSchlitzer, M Synthesis, molecular modeling, and structure-activity relationship of benzophenone-based CAAX-peptidomimetic farnesyltransferase inhibitors. J Med Chem 44:2886-99 (2001)  
Target
Name:
Protein farnesyltransferase subunit beta/geranylgeranyltransferase type-1 subunit alpha
Synonyms:
Farnesyltransferase Protein farnesyltransferase beta/geranylgeranyltransferase type I alpha subunit
Type:
Mol. Mass.:
Description:
ASSAY_ID of EBI is 70753
Components:
This complex has 2 components.
Component 1
Name:
Protein farnesyltransferase subunit beta
Synonyms:
CAAX farnesyltransferase subunit beta FNTB_YEAST Farnesyltransferase Ras proteins prenyltransferase subunit beta STE16
Type:
Protein
Mol. Mass.:
48188.41
Organism:
Saccharomyces cerevisiae (Baker's yeast)
Description:
P22007
Residue:
431
  
Component 2
Name:
Protein farnesyltransferase/geranylgeranyltransferase type-1 subunit alpha
Synonyms:
CAAX farnesyltransferase subunit alpha FTase-alpha GGTase-I-alpha Protein farnesyltransferase/geranylgeranyltransferase type-1 subunit alpha Ras proteins prenyltransferase subunit alpha | Type I protein geranyl-geranyltransferase subunit alpha
Type:
PROTEIN
Mol. Mass.:
37495.69
Organism:
Saccharomyces cerevisiae
Description:
ChEMBL_588425
Residue:
316
  
Inhibitor
Name:
BDBM50103262
Synonyms:
1-{3-Benzoyl-4-[2-(4-chloro-phenyl)-acetylamino]-phenylcarbamoyl}-2-mercapto-ethyl-ammonium; chloride | CHEMBL97156
Type:
Small organic molecule
Emp. Form.:
C24H23ClN3O3S
Mol. Mass.:
468.975
SMILES:
[NH3+][C@@H](CS)C(=O)Nc1ccc(NC(=O)Cc2ccc(Cl)cc2)c(c1)C(=O)c1ccccc1
: