Target
Neuropeptide Y receptor type 5
Ligand
BDBM50073048
Substrate
Meas. Tech.
ChEMBL_143985 (CHEMBL750823)
IC50
0.470000±n/a nM
Citation
 Kordik, CPLuo, CZanoni, BCDax, SLMcNally, JJLovenberg, TWWilson, SJReitz, AB Aminopyrazoles with high affinity for the human neuropeptide Y5 receptor. Bioorg Med Chem Lett 11:2283-6 (2001)  
Target
Name:
Neuropeptide Y receptor type 5
Synonyms:
NPY-Y5 NPY5-R NPY5R_HUMAN NPYY5 Neuropeptide Y receptor type 5 ( NPY Y5) | Y5 receptor
Type:
Enzyme
Mol. Mass.:
50746.64
Organism:
Homo sapiens (Human)
Description:
Q15761
Residue:
445
  
Inhibitor
Name:
BDBM50073048
Synonyms:
2-[4-(2-Oxo-2,3-dihydro-benzoimidazol-1-yl)-piperidin-1-yl]-N-(9-oxo-9H-fluoren-3-yl)-acetamide | CHEMBL62166
Type:
Small organic molecule
Emp. Form.:
C27H24N4O3
Mol. Mass.:
452.5045
SMILES:
O=C(CN1CCC(CC1)n1c2ccccc2[nH]c1=O)Nc1ccc2C(=O)c3ccccc3-c2c1
: