Target
Neuropeptide Y receptor type 5
Ligand
BDBM50103694
Substrate
Meas. Tech.
ChEBML_140799
IC50
30±n/a nM
Citation
 Kordik, CPLuo, CZanoni, BCDax, SLMcNally, JJLovenberg, TWWilson, SJReitz, AB Aminopyrazoles with high affinity for the human neuropeptide Y5 receptor. Bioorg Med Chem Lett 11:2283-6 (2001)  
Target
Name:
Neuropeptide Y receptor type 5
Synonyms:
NPY-Y5 NPY5-R NPY5R_HUMAN NPYY5 Neuropeptide Y receptor type 5 ( NPY Y5) | Y5 receptor
Type:
Enzyme
Mol. Mass.:
50746.64
Organism:
Homo sapiens (Human)
Description:
Q15761
Residue:
445
  
Inhibitor
Name:
BDBM50103694
Synonyms:
CHEMBL73643 | N-{4-[5-Amino-1-(3-dimethylamino-phenyl)-1H-pyrazol-3-yl]-phenyl}-4-methoxy-benzenesulfonamide
Type:
Small organic molecule
Emp. Form.:
C24H25N5O3S
Mol. Mass.:
463.552
SMILES:
COc1ccc(cc1)S(=O)(=O)Nc1ccc(cc1)-c1cc(N)n(n1)-c1cccc(c1)N(C)C
: