Target
Neuropeptide Y receptor type 5
Ligand
BDBM50103708
Substrate
Meas. Tech.
ChEBML_140799
IC50
25±n/a nM
Citation
 Kordik, CPLuo, CZanoni, BCDax, SLMcNally, JJLovenberg, TWWilson, SJReitz, AB Aminopyrazoles with high affinity for the human neuropeptide Y5 receptor. Bioorg Med Chem Lett 11:2283-6 (2001)  
Target
Name:
Neuropeptide Y receptor type 5
Synonyms:
NPY-Y5 NPY5-R NPY5R_HUMAN NPYY5 Neuropeptide Y receptor type 5 ( NPY Y5) | Y5 receptor
Type:
Enzyme
Mol. Mass.:
50746.64
Organism:
Homo sapiens (Human)
Description:
Q15761
Residue:
445
  
Inhibitor
Name:
BDBM50103708
Synonyms:
CHEMBL75823 | N-[4-(5-Amino-1-p-tolyl-1H-pyrazol-3-yl)-phenyl]-benzenesulfonamide
Type:
Small organic molecule
Emp. Form.:
C22H20N4O2S
Mol. Mass.:
404.485
SMILES:
Cc1ccc(cc1)-n1nc(cc1N)-c1ccc(NS(=O)(=O)c2ccccc2)cc1
: