Target
D(2) dopamine receptor
Ligand
BDBM50103837
Substrate
Meas. Tech.
ChEBML_61118
Ki
12±n/a nM
Citation
 Feenstra, RWde Moes, JHofma, JJKling, HKuipers, WLong, SKTulp, MTvan der Heyden, JAKruse, CG New 1-aryl-4-(biarylmethylene)piperazines as potential atypical antipsychotics sharing dopamine D(2)-receptor and serotonin 5-HT(1A)-receptor affinities. Bioorg Med Chem Lett 11:2345-9 (2001)  
Target
Name:
D(2) dopamine receptor
Synonyms:
D(2) dopamine receptor DOPAMINE D2 Long DRD2 Dopamine D2 receptor Dopamine D2 receptor (D2R) Dopamine2-like | d2
Type:
Cell-surface receptors
Mol. Mass.:
50647.10
Organism:
Homo sapiens (Human)
Description:
P14416
Residue:
443
  
Inhibitor
Name:
BDBM50103837
Synonyms:
7-[4-(4-Fluoro-biphenyl-3-ylmethyl)-piperazin-1-yl]-3H-benzooxazol-2-one | CHEMBL77334
Type:
Small organic molecule
Emp. Form.:
C24H22FN3O2
Mol. Mass.:
403.4488
SMILES:
Fc1ccc(cc1CN1CCN(CC1)c1cccc2[nH]c(=O)oc12)-c1ccccc1
: