Target
5-hydroxytryptamine receptor 1A
Ligand
BDBM50103839
Substrate
Meas. Tech.
ChEBML_1543
Ki
16±n/a nM
Citation
 Feenstra, RWde Moes, JHofma, JJKling, HKuipers, WLong, SKTulp, MTvan der Heyden, JAKruse, CG New 1-aryl-4-(biarylmethylene)piperazines as potential atypical antipsychotics sharing dopamine D(2)-receptor and serotonin 5-HT(1A)-receptor affinities. Bioorg Med Chem Lett 11:2345-9 (2001)  
Target
Name:
5-hydroxytryptamine receptor 1A
Synonyms:
5-HT-1A 5-hydroxytryptamine receptor 1A (5-HT-1A) ADRB2RL1 Dopamine D2 receptor and serotonin 1a receptor HTR1A | Serotonin receptor 1A
Type:
Mol. Mass.:
46122.49
Organism:
Homo sapiens (Human)
Description:
Residue:
422
  
Inhibitor
Name:
BDBM50103839
Synonyms:
7-{4-[4-(4-Fluoro-phenyl)-pyridin-2-ylmethyl]-piperazin-1-yl}-3H-benzooxazol-2-one | CHEMBL308345
Type:
Small organic molecule
Emp. Form.:
C23H21FN4O2
Mol. Mass.:
404.4368
SMILES:
Fc1ccc(cc1)-c1ccnc(CN2CCN(CC2)c2cccc3[nH]c(=O)oc23)c1
: