Target
D(2) dopamine receptor
Ligand
BDBM50103847
Substrate
Meas. Tech.
ChEBML_61118
Ki
2±n/a nM
Citation
 Feenstra, RWde Moes, JHofma, JJKling, HKuipers, WLong, SKTulp, MTvan der Heyden, JAKruse, CG New 1-aryl-4-(biarylmethylene)piperazines as potential atypical antipsychotics sharing dopamine D(2)-receptor and serotonin 5-HT(1A)-receptor affinities. Bioorg Med Chem Lett 11:2345-9 (2001)  
Target
Name:
D(2) dopamine receptor
Synonyms:
D(2) dopamine receptor DOPAMINE D2 Long DRD2 Dopamine D2 receptor Dopamine D2 receptor (D2R) Dopamine2-like | d2
Type:
Cell-surface receptors
Mol. Mass.:
50647.10
Organism:
Homo sapiens (Human)
Description:
P14416
Residue:
443
  
Inhibitor
Name:
BDBM50103847
Synonyms:
3'-[4-(2-Oxo-2,3-dihydro-benzooxazol-7-yl)-piperazin-1-ylmethyl]-biphenyl-2-carbonitrile | CHEMBL420016
Type:
Small organic molecule
Emp. Form.:
C25H22N4O2
Mol. Mass.:
410.4678
SMILES:
O=c1[nH]c2cccc(N3CCN(Cc4cccc(c4)-c4ccccc4C#N)CC3)c2o1
: