Target
Protein farnesyltransferase subunit beta/geranylgeranyltransferase type-1 subunit alpha
Ligand
BDBM50080764
Substrate
Meas. Tech.
ChEMBL_70756 (CHEMBL682843)
IC50
0.10±n/a nM
Citation
 Böhm, MMitsch, AWissner, PSattler, ISchlitzer, M Exploration of novel aryl binding sites of farnesyltransferase using molecular modeling and benzophenone-based farnesyltransferase inhibitors. J Med Chem 44:3117-24 (2001)  
Target
Name:
Protein farnesyltransferase subunit beta/geranylgeranyltransferase type-1 subunit alpha
Synonyms:
Farnesyltransferase Protein farnesyltransferase beta/geranylgeranyltransferase type I alpha subunit
Type:
Mol. Mass.:
Description:
ASSAY_ID of EBI is 70753
Components:
This complex has 2 components.
Component 1
Name:
Protein farnesyltransferase subunit beta
Synonyms:
CAAX farnesyltransferase subunit beta FNTB_YEAST Farnesyltransferase Ras proteins prenyltransferase subunit beta STE16
Type:
Protein
Mol. Mass.:
48188.41
Organism:
Saccharomyces cerevisiae (Baker's yeast)
Description:
P22007
Residue:
431
  
Component 2
Name:
Protein farnesyltransferase/geranylgeranyltransferase type-1 subunit alpha
Synonyms:
CAAX farnesyltransferase subunit alpha FTase-alpha GGTase-I-alpha Protein farnesyltransferase/geranylgeranyltransferase type-1 subunit alpha Ras proteins prenyltransferase subunit alpha | Type I protein geranyl-geranyltransferase subunit alpha
Type:
PROTEIN
Mol. Mass.:
37495.69
Organism:
Saccharomyces cerevisiae
Description:
ChEMBL_588425
Residue:
316
  
Inhibitor
Name:
BDBM50080764
Synonyms:
(S)-2-({5-[(Benzyl-pyridin-3-yl-amino)-methyl]-2'-methyl-biphenyl-2-carbonyl}-amino)-4-methylsulfanyl-butyric acid CHEMBL108161
Type:
Small organic molecule
Emp. Form.:
C32H33N3O3S
Mol. Mass.:
539.688
SMILES:
CSCC[C@H](NC(=O)c1ccc(CN(Cc2ccccc2)c2cccnc2)cc1-c1ccccc1C)C(O)=O
: