Target
Adenosine kinase
Ligand
BDBM50104164
Substrate
Meas. Tech.
ChEBML_31126
IC50
4±n/a nM
Citation
 Lee, CHDaanen, JFJiang, MYu, HKohlhaas, KLAlexander, KJarvis, MFKowaluk, ELBhagwat, SS Synthesis and biological evaluation of clitocine analogues as adenosine kinase inhibitors. Bioorg Med Chem Lett 11:2419-22 (2001)  
Target
Name:
Adenosine kinase
Synonyms:
ADENOSINE Adenosine 5-phosphotransferase Adenosine kinase | Adk
Type:
Enzyme
Mol. Mass.:
40130.14
Organism:
Rattus norvegicus (rat)
Description:
Rat brain cytosol as enzyme source.
Residue:
361
  
Inhibitor
Name:
BDBM50104164
Synonyms:
4-((2R,3R,4S,5R)-5-Aminomethyl-3,4-dihydroxy-tetrahydro-furan-2-ylamino)-pyrimidine-5-carboxylic acid methyl ester | CHEMBL407574
Type:
Small organic molecule
Emp. Form.:
C11H16N4O5
Mol. Mass.:
284.2685
SMILES:
COC(=O)c1cncnc1N[C@@H]1O[C@H](CN)[C@@H](O)[C@H]1O
: