Target
Glucagon receptor
Ligand
BDBM50075778
Substrate
Meas. Tech.
ChEBML_72873
IC50
490.0±n/a nM
Citation
 Chang, LLSidler, KLCascieri, MAde Laszlo, SKoch, GLi, BMacCoss, MMantlo, NO'Keefe, SPang, MRolando, AHagmann, WK Substituted imidazoles as glucagon receptor antagonists. Bioorg Med Chem Lett 11:2549-53 (2001)  
Target
Name:
Glucagon receptor
Synonyms:
GCGR GLR_HUMAN Glucagon receptor (GlucR)
Type:
Enzyme
Mol. Mass.:
54026.92
Organism:
Homo sapiens (Human)
Description:
P47871
Residue:
477
  
Inhibitor
Name:
BDBM50075778
Synonyms:
4-[5-(4-Fluoro-phenyl)-2-(4-methylsulfanyl-phenyl)-1H-imidazol-4-yl]-pyridine CHEMBL17370
Type:
Small organic molecule
Emp. Form.:
C21H16FN3S
Mol. Mass.:
361.435
SMILES:
CSc1ccc(cc1)-c1nc(c([nH]1)-c1ccc(F)cc1)-c1ccncc1
: