Target
Nitric oxide synthase, endothelial
Ligand
BDBM50104659
Substrate
Meas. Tech.
ChEBML_65299
IC50
72680.0±n/a nM
Citation
 Moormann, AEMetz, SToth, MVMoore, WMJerome, GKornmeier, CManning, PHansen, DWPitzele, BSWebber, RK Selective heterocyclic amidine inhibitors of human inducible nitric oxide synthase. Bioorg Med Chem Lett 11:2651-3 (2001)  
Target
Name:
Nitric oxide synthase, endothelial
Synonyms:
Constitutive NOS Endothelial NOS NOS type III NOS3_HUMAN Nitric oxide synthase (inducible and endothelial) Nitric-oxide synthase (endothelial and brain) eNOS
Type:
Enzyme Catalytic Domain
Mol. Mass.:
133297.84
Organism:
Homo sapiens (Human)
Description:
P29474
Residue:
1203
  
Inhibitor
Name:
BDBM50104659
Synonyms:
CHEMBL330548 [1,4]Oxazepan-(5Z)-ylideneamine
Type:
Small organic molecule
Emp. Form.:
C5H10N2O
Mol. Mass.:
114.1457
SMILES:
NC1=NCCOCC1
: