Target
M-phase inducer phosphatase 2
Ligand
BDBM50104685
Substrate
Meas. Tech.
ChEMBL_49038 (CHEMBL662076)
IC50
>125000±n/a nM
Citation
 Sodeoka, MSampe, RKojima, SBaba, YUsui, TUeda, KOsada, H Synthesis of a tetronic acid library focused on inhibitors of tyrosine and dual-specificity protein phosphatases and its evaluation regarding VHR and cdc25B inhibition. J Med Chem 44:3216-22 (2001)  
Target
Name:
M-phase inducer phosphatase 2
Synonyms:
Cdc25b Dual specificity phosphatase Cdc25B MPIP2_MOUSE
Type:
PROTEIN
Mol. Mass.:
65485.87
Organism:
Mus musculus
Description:
ChEMBL_49038
Residue:
576
  
Inhibitor
Name:
BDBM50104685
Synonyms:
4-Hydroxy-5-hydroxymethyl-2-oxo-2,5-dihydro-furan-3-carboxylic acid benzyl ester | CHEMBL109577
Type:
Small organic molecule
Emp. Form.:
C13H12O6
Mol. Mass.:
264.2308
SMILES:
OCc1oc(O)c(C(=O)OCc2ccccc2)c1O
: