Target
Sodium/hydrogen exchanger 1
Ligand
BDBM50104846
Substrate
Meas. Tech.
ChEMBL_141046 (CHEMBL746894)
IC50
5±n/a nM
Citation
 Ahmad, SDoweyko, LMDugar, SGrazier, NNgu, KWu, SCYost, KJChen, BCGougoutas, JZDiMarco, JDLan, SJGavin, BJChen, AYDorso, CRSerafino, RKirby, MAtwal, KS Arylcyclopropanecarboxyl guanidines as novel, potent, and selective inhibitors of the sodium hydrogen exchanger isoform-1. J Med Chem 44:3302-10 (2001)  
Target
Name:
Sodium/hydrogen exchanger 1
Synonyms:
APNH NHE-1 Na(+)/H(+) antiporter, amiloride-sensitive SL9A1_HUMAN Solute carrier family 9 member 1
Type:
PROTEIN
Mol. Mass.:
90771.96
Organism:
Homo sapiens (Human)
Description:
ChEMBL_862405
Residue:
815
  
Inhibitor
Name:
BDBM50104846
Synonyms:
CHEMBL113443 | N-[3-(2,5-Dichloro-phenyl)-2,2-dimethyl-cyclopropanecarbonyl]-guanidine
Type:
Small organic molecule
Emp. Form.:
C13H15Cl2N3O
Mol. Mass.:
300.184
SMILES:
CC1(C)[C@@H]([C@H]1c1cc(Cl)ccc1Cl)C(=O)NC(N)=N
: