Target
Aldehyde dehydrogenase, mitochondrial
Ligand
BDBM50104891
Substrate
Meas. Tech.
ChEMBL_31176 (CHEMBL641141)
IC50
1500±n/a nM
Citation
 Gao, GYLi, DJKeung, WM Synthesis of potential antidipsotropic isoflavones: inhibitors of the mitochondrial monoamine oxidase-aldehyde dehydrogenase pathway. J Med Chem 44:3320-8 (2001)  
Target
Name:
Aldehyde dehydrogenase, mitochondrial
Synonyms:
ALDH class 2 ALDH2 ALDHI Aldehyde dehydrogenase (ALDH2)
Type:
Enzyme
Mol. Mass.:
56382.67
Organism:
Homo sapiens (Human)
Description:
P05091
Residue:
517
  
Inhibitor
Name:
BDBM50104891
Synonyms:
7-Hydroxy-4-phenyl-chromen-2-one CHEMBL325841 cid_5357479
Type:
Small organic molecule
Emp. Form.:
C15H10O3
Mol. Mass.:
238.2381
SMILES:
Oc1ccc2c(cc(=O)oc2c1)-c1ccccc1
: