Target
Aldehyde dehydrogenase, mitochondrial
Ligand
BDBM50104897
Substrate
Meas. Tech.
ChEMBL_31176 (CHEMBL641141)
IC50
7200±n/a nM
Citation
 Gao, GYLi, DJKeung, WM Synthesis of potential antidipsotropic isoflavones: inhibitors of the mitochondrial monoamine oxidase-aldehyde dehydrogenase pathway. J Med Chem 44:3320-8 (2001)  
Target
Name:
Aldehyde dehydrogenase, mitochondrial
Synonyms:
ALDH class 2 ALDH2 ALDHI Aldehyde dehydrogenase (ALDH2)
Type:
Enzyme
Mol. Mass.:
56382.67
Organism:
Homo sapiens (Human)
Description:
P05091
Residue:
517
  
Inhibitor
Name:
BDBM50104897
Synonyms:
2-[3-(4-Hydroxy-phenyl)-4-oxo-4H-chromen-7-yloxy]-octanoic acid ethyl ester | CHEMBL113855
Type:
Small organic molecule
Emp. Form.:
C25H28O6
Mol. Mass.:
424.4862
SMILES:
CCCCCCC(Oc1ccc2c(c1)occ(-c1ccc(O)cc1)c2=O)C(=O)OCC
: