Target
Neutrophil collagenase
Ligand
BDBM50104970
Substrate
Meas. Tech.
ChEMBL_105198 (CHEMBL713837)
Ki
1192±n/a nM
Citation
 Yao, WWasserman, ZRChao, MReddy, GShi, ELiu, RQCovington, MBArner, ECPratta, MATortorella, MMagolda, RLNewton, RQian, MRibadeneira, MDChrist, DWexler, RRDecicco, CP Design and synthesis of a series of (2R)-N(4)-hydroxy-2-(3-hydroxybenzyl)-N(1)- [(1S,2R)-2-hydroxy-2,3-dihydro-1H-inden-1-yl]butanediamide derivatives as potent, selective, and orally bioavailable aggrecanase inhibitors. J Med Chem 44:3347-50 (2001)  
Target
Name:
Neutrophil collagenase
Synonyms:
CLG1 MMP8 Matrix metalloproteinase-8 PMNL collagenase | PMNL-CL
Type:
Enzyme
Mol. Mass.:
53413.48
Organism:
Homo sapiens (Human)
Description:
P22894
Residue:
467
  
Inhibitor
Name:
BDBM50104970
Synonyms:
CHEMBL114357 | N*4*-Hydroxy-N*1*-(2-hydroxy-indan-1-yl)-2-(3-methoxy-benzyl)-succinamide
Type:
Small organic molecule
Emp. Form.:
C21H24N2O5
Mol. Mass.:
384.4257
SMILES:
COc1cccc(C[C@H](CC(=O)NO)C(=O)N[C@@H]2[C@H](O)Cc3ccccc23)c1
: