Target
Disintegrin and metalloproteinase domain-containing protein 17
Ligand
BDBM50104978
Substrate
Meas. Tech.
ChEMBL_206141 (CHEMBL814098)
Ki
3.7±n/a nM
Citation
 Xue, CBHe, XCorbett, RLRoderick, JWasserman, ZRLiu, RQJaffee, BDCovington, MBQian, MTrzaskos, JMNewton, RCMagolda, RLWexler, RRDecicco, CP Discovery of macrocyclic hydroxamic acids containing biphenylmethyl derivatives at P1', a series of selective TNF-alpha converting enzyme inhibitors with potent cellular activity in the inhibition of TNF-alpha release. J Med Chem 44:3351-4 (2001)  
Target
Name:
Disintegrin and metalloproteinase domain-containing protein 17
Synonyms:
A disintegrin and metalloproteinase domain 17 ADAM 17 Snake venom-like protease TNF-alpha-Converting Enzyme
Type:
Metalloprotease
Mol. Mass.:
12197.99
Organism:
Sus scrofa (pig)
Description:
Partially purified TACE was obtained from porcine spleen.
Residue:
112
  
Inhibitor
Name:
BDBM50104978
Synonyms:
2,10-Dioxo-11-(3'-trifluoromethyl-biphenyl-4-ylmethyl)-1-oxa-3,9-diaza-cyclopentadecane-8,12-dicarboxylic acid 12-hydroxyamide 8-[(2-oxo-2-piperazin-1-yl-ethyl)-amide] | CHEMBL325421
Type:
Small organic molecule
Emp. Form.:
C34H43F3N6O7
Mol. Mass.:
704.7364
SMILES:
ONC(=O)[C@H]1CCCOC(=O)NCCCC[C@H](NC(=O)[C@@H]1Cc1ccc(cc1)-c1cccc(c1)C(F)(F)F)C(=O)NCC(=O)N1CCNCC1
: