Target
Endothelin receptor type B
Ligand
BDBM50105015
Substrate
Meas. Tech.
ChEMBL_63521 (CHEMBL677269)
IC50
1100±n/a nM
Citation
 Morimoto, HShimadzu, HKushiyama, EKawanishi, HHosaka, TKawase, YYasuda, KKikkawa, KYamauchi-Kohno, RYamada, K Potent and selective ET-A antagonists. 1. Syntheses and structure-activity relationships of N-(6-(2-(aryloxy)ethoxy)-4-pyrimidinyl)sulfonamide derivatives. J Med Chem 44:3355-68 (2001)  
Target
Name:
Endothelin receptor type B
Synonyms:
EDNRB ENDOTHELIN B ETRB Endothelin receptor non-selective type | Endothelin receptor, ET-A/ET-B
Type:
Enzyme Catalytic Domain
Mol. Mass.:
49664.00
Organism:
Homo sapiens (Human)
Description:
ENDOTHELIN B EDNRB HUMAN::P24530
Residue:
442
  
Inhibitor
Name:
BDBM50105015
Synonyms:
4-(4-tert-Butyl-pyrimidin-1-yl)-N-(2-hydroxy-ethoxy)-3-(3-methoxy-phenoxy)-benzenesulfonamide CHEMBL115951 | Ro-46-2005
Type:
Small organic molecule
Emp. Form.:
C23H27N3O6S
Mol. Mass.:
473.542
SMILES:
COc1cccc(Oc2c(NS(=O)(=O)c3ccc(cc3)C(C)(C)C)ncnc2OCCO)c1
: