Target
Endothelin-1 receptor
Ligand
BDBM50105000
Substrate
Meas. Tech.
ChEMBL_65802 (CHEMBL679705)
IC50
7.5±n/a nM
Citation
 Morimoto, HShimadzu, HKushiyama, EKawanishi, HHosaka, TKawase, YYasuda, KKikkawa, KYamauchi-Kohno, RYamada, K Potent and selective ET-A antagonists. 1. Syntheses and structure-activity relationships of N-(6-(2-(aryloxy)ethoxy)-4-pyrimidinyl)sulfonamide derivatives. J Med Chem 44:3355-68 (2001)  
Target
Name:
Endothelin-1 receptor
Synonyms:
EDNRA Endothelin receptor ET-A
Type:
PROTEIN
Mol. Mass.:
48707.29
Organism:
Sus scrofa
Description:
ChEMBL_65803
Residue:
427
  
Inhibitor
Name:
BDBM50105000
Synonyms:
CHEMBL175616 | sodium salt of 4-tert-Butyl-N-[6-(2-hydroxy-ethoxy)-5-(2-methoxy-phenoxy)-[2,2']bipyrimidinyl-4-yl]-benzenesulfonamide
Type:
Small organic molecule
Emp. Form.:
C27H28N5O6S
Mol. Mass.:
550.607
SMILES:
COc1ccccc1Oc1c([N-]S(=O)(=O)c2ccc(cc2)C(C)(C)C)nc(nc1OCCO)-c1ncccn1
: