Target
Endothelin-1 receptor
Ligand
BDBM50105019
Substrate
Meas. Tech.
ChEMBL_65802 (CHEMBL679705)
IC50
0.76±n/a nM
Citation
 Morimoto, HShimadzu, HKushiyama, EKawanishi, HHosaka, TKawase, YYasuda, KKikkawa, KYamauchi-Kohno, RYamada, K Potent and selective ET-A antagonists. 1. Syntheses and structure-activity relationships of N-(6-(2-(aryloxy)ethoxy)-4-pyrimidinyl)sulfonamide derivatives. J Med Chem 44:3355-68 (2001)  
Target
Name:
Endothelin-1 receptor
Synonyms:
EDNRA Endothelin receptor ET-A
Type:
PROTEIN
Mol. Mass.:
48707.29
Organism:
Sus scrofa
Description:
ChEMBL_65803
Residue:
427
  
Inhibitor
Name:
BDBM50105019
Synonyms:
CHEMBL111934 | N-{6-[2-(5-Bromo-pyrimidin-2-yloxy)-ethoxy]-5-p-tolyl-pyrimidin-4-yl}-4-methoxy-benzenesulfonamide
Type:
Small organic molecule
Emp. Form.:
C24H22BrN5O5S
Mol. Mass.:
572.431
SMILES:
COc1ccc(cc1)S(=O)(=O)Nc1ncnc(OCCOc2ncc(Br)cn2)c1-c1ccc(C)cc1
: