Target
Endothelin-1 receptor
Ligand
BDBM50105043
Substrate
Meas. Tech.
ChEMBL_65802 (CHEMBL679705)
IC50
1.9±n/a nM
Citation
 Morimoto, HShimadzu, HKushiyama, EKawanishi, HHosaka, TKawase, YYasuda, KKikkawa, KYamauchi-Kohno, RYamada, K Potent and selective ET-A antagonists. 1. Syntheses and structure-activity relationships of N-(6-(2-(aryloxy)ethoxy)-4-pyrimidinyl)sulfonamide derivatives. J Med Chem 44:3355-68 (2001)  
Target
Name:
Endothelin-1 receptor
Synonyms:
EDNRA Endothelin receptor ET-A
Type:
PROTEIN
Mol. Mass.:
48707.29
Organism:
Sus scrofa
Description:
ChEMBL_65803
Residue:
427
  
Inhibitor
Name:
BDBM50105043
Synonyms:
1,2,3,4-Tetrahydro-fluoren-9-one salt ofN-{6-[2-(5-Bromo-pyrimidin-2-yloxy)-ethoxy]-5-p-tolyl-pyrimidin-4-yl}-4-chloro-benzenesulfonamide | CHEMBL175931
Type:
Small organic molecule
Emp. Form.:
C23H19BrClN5O4S
Mol. Mass.:
576.85
SMILES:
Cc1ccc(cc1)-c1c(NS(=O)(=O)c2ccc(Cl)cc2)ncnc1OCCOc1ncc(Br)cn1
: