Target
Endothelin-1 receptor
Ligand
BDBM50105045
Substrate
Meas. Tech.
ChEMBL_65802 (CHEMBL679705)
IC50
6.2±n/a nM
Citation
 Morimoto, HShimadzu, HKushiyama, EKawanishi, HHosaka, TKawase, YYasuda, KKikkawa, KYamauchi-Kohno, RYamada, K Potent and selective ET-A antagonists. 1. Syntheses and structure-activity relationships of N-(6-(2-(aryloxy)ethoxy)-4-pyrimidinyl)sulfonamide derivatives. J Med Chem 44:3355-68 (2001)  
Target
Name:
Endothelin-1 receptor
Synonyms:
EDNRA Endothelin receptor ET-A
Type:
PROTEIN
Mol. Mass.:
48707.29
Organism:
Sus scrofa
Description:
ChEMBL_65803
Residue:
427
  
Inhibitor
Name:
BDBM50105045
Synonyms:
4-tert-Butyl-N-{5-(3-methoxy-phenoxy)-6-[2-(pyrimidin-2-yloxy)-ethylamino]-pyrimidin-4-yl}-benzenesulfonamide; compound with methane | CHEMBL442031
Type:
Small organic molecule
Emp. Form.:
C27H30N6O5S
Mol. Mass.:
550.629
SMILES:
COc1cccc(Oc2c(NCCOc3ncccn3)ncnc2NS(=O)(=O)c2ccc(cc2)C(C)(C)C)c1
: