Target
Calpain-1 catalytic subunit
Ligand
BDBM50105238
Substrate
Meas. Tech.
ChEMBL_43496 (CHEMBL877099)
IC50
24±n/a nM
Citation
 Wells, GJTao, MJosef, KABihovsky, R 1,2-Benzothiazine 1,1-dioxide P(2)-P(3) peptide mimetic aldehyde calpain I inhibitors. J Med Chem 44:3488-503 (2001)  
Target
Name:
Calpain-1 catalytic subunit
Synonyms:
CAN1_HUMAN CAPN1 Calpain-1 (u-Calpain) Calpain1
Type:
Protein
Mol. Mass.:
81880.51
Organism:
Homo sapiens (Human)
Description:
Residue:
714
  
Inhibitor
Name:
BDBM50105238
Synonyms:
2-Methyl-1,1-dioxo-1,2,3,4,6,7-hexahydro-5,8-dioxa-1lambda*6*-thia-2-aza-anthracene-3-carboxylic acid (1-benzyl-2-oxo-ethyl)-amide(3R,3S diastereomeric mixture) | CHEMBL115954
Type:
Small organic molecule
Emp. Form.:
C21H22N2O6S
Mol. Mass.:
430.474
SMILES:
CN1C(Cc2cc3OCCOc3cc2S1(=O)=O)C(=O)N[C@@H](Cc1ccccc1)C=O
: