Target
Retinoid isomerohydrolase
Ligand
BDBM323415
Substrate
Meas. Tech.
ChEMBL_2015623 (CHEMBL4669201)
EC50
172±n/a nM
Citation
 Blum, EZhang, JKorshin, EPalczewski, KGruzman, A Development of chiral fluorinated alkyl derivatives of emixustat as drug candidates for the treatment of retinal degenerative diseases. Bioorg Med Chem Lett 30:0 (2020)  
Target
Name:
Retinoid isomerohydrolase
Synonyms:
Lutein isomerase RPE65 Retinal pigment epithelium-specific 65 kDa protein | Retinoid isomerohydrolase
Type:
Enzyme Catalytic Domain
Mol. Mass.:
60942.63
Organism:
Bos taurus (Bovine)
Description:
Q28175
Residue:
533
  
Inhibitor
Name:
BDBM323415
Synonyms:
3-Amino-1-(3-(cyclohexylmethoxy)Phenyl)Propan-1-Ol US10639286, Example 4
Type:
Small organic molecule
Emp. Form.:
C16H25NO2
Mol. Mass.:
263.3752
SMILES:
NCCC(O)c1cccc(OCC2CCCCC2)c1
: