Target
C-C chemokine receptor type 5
Ligand
BDBM50105506
Substrate
Meas. Tech.
ChEBML_39629
IC50
12±n/a nM
Citation
 Hale, JJBudhu, RJHolson, EBFinke, PEOates, BMills, SGMacCoss, MGould, SLDeMartino, JASpringer, MSSiciliano, SMalkowitz, LSchleif, WAHazuda, DMiller, MKessler, JDanzeisen, RHolmes, KLineberger, JCarella, ACarver, GEmini, E 1,3,4-Trisubstituted pyrrolidine CCR5 receptor antagonists. Part 2: lead optimization affording selective, orally bioavailable compounds with potent anti-HIV activity. Bioorg Med Chem Lett 11:2741-5 (2001)  
Target
Name:
C-C chemokine receptor type 5
Synonyms:
C-C CKR-5 CC-CKR-5 CCR5 CCR5_HUMAN CHEMR13 HIV-1 fusion coreceptor
Type:
Enzyme
Mol. Mass.:
40540.21
Organism:
Homo sapiens (Human)
Description:
P51681
Residue:
352
  
Inhibitor
Name:
BDBM50105506
Synonyms:
CHEMBL93961 | {1-[(3S,4S)-1-(2-Chloro-benzoyl)-4-phenyl-pyrrolidin-3-ylmethyl]-piperidin-4-yl}-cyclopentylmethyl-carbamic acid methyl ester
Type:
Small organic molecule
Emp. Form.:
C31H40ClN3O3
Mol. Mass.:
538.121
SMILES:
COC(=O)N(CC1CCCC1)C1CCN(C[C@H]2CN(C[C@@H]2c2ccccc2)C(=O)c2ccccc2Cl)CC1
: