Target
C-C chemokine receptor type 5
Ligand
BDBM50105510
Substrate
Meas. Tech.
ChEBML_39629
IC50
0.100000±n/a nM
Citation
 Hale, JJBudhu, RJHolson, EBFinke, PEOates, BMills, SGMacCoss, MGould, SLDeMartino, JASpringer, MSSiciliano, SMalkowitz, LSchleif, WAHazuda, DMiller, MKessler, JDanzeisen, RHolmes, KLineberger, JCarella, ACarver, GEmini, E 1,3,4-Trisubstituted pyrrolidine CCR5 receptor antagonists. Part 2: lead optimization affording selective, orally bioavailable compounds with potent anti-HIV activity. Bioorg Med Chem Lett 11:2741-5 (2001)  
Target
Name:
C-C chemokine receptor type 5
Synonyms:
C-C CKR-5 CC-CKR-5 CCR5 CCR5_HUMAN CHEMR13 HIV-1 fusion coreceptor
Type:
Enzyme
Mol. Mass.:
40540.21
Organism:
Homo sapiens (Human)
Description:
P51681
Residue:
352
  
Inhibitor
Name:
BDBM50105510
Synonyms:
Allyl-{1-[(S)-4-(benzenesulfonyl-methyl-amino)-3-methyl-3-phenyl-butyl]-piperidin-4-yl}-carbamic acid 4-nitro-benzyl ester | CHEMBL93139
Type:
Small organic molecule
Emp. Form.:
C34H42N4O6S
Mol. Mass.:
634.785
SMILES:
CN(C[C@@](C)(CCN1CCC(CC1)N(CC=C)C(=O)OCc1ccc(cc1)[N+]([O-])=O)c1ccccc1)S(=O)(=O)c1ccccc1
: