Target
C-C chemokine receptor type 5
Ligand
BDBM50105513
Substrate
Meas. Tech.
ChEBML_39629
IC50
>1000±n/a nM
Citation
 Hale, JJBudhu, RJHolson, EBFinke, PEOates, BMills, SGMacCoss, MGould, SLDeMartino, JASpringer, MSSiciliano, SMalkowitz, LSchleif, WAHazuda, DMiller, MKessler, JDanzeisen, RHolmes, KLineberger, JCarella, ACarver, GEmini, E 1,3,4-Trisubstituted pyrrolidine CCR5 receptor antagonists. Part 2: lead optimization affording selective, orally bioavailable compounds with potent anti-HIV activity. Bioorg Med Chem Lett 11:2741-5 (2001)  
Target
Name:
C-C chemokine receptor type 5
Synonyms:
C-C CKR-5 CC-CKR-5 CCR5 CCR5_HUMAN CHEMR13 HIV-1 fusion coreceptor
Type:
Enzyme
Mol. Mass.:
40540.21
Organism:
Homo sapiens (Human)
Description:
P51681
Residue:
352
  
Inhibitor
Name:
BDBM50105513
Synonyms:
1-((3S,4S)-1,4-Diphenyl-pyrrolidin-3-ylmethyl)-4-phenyl-piperidine | CHEMBL93887
Type:
Small organic molecule
Emp. Form.:
C28H32N2
Mol. Mass.:
396.5671
SMILES:
C([C@H]1CN(C[C@@H]1c1ccccc1)c1ccccc1)N1CCC(CC1)c1ccccc1
: