Target
5-hydroxytryptamine receptor 4
Ligand
BDBM50105635
Substrate
Meas. Tech.
ChEMBL_3346 (CHEMBL619046)
Ki
0.11±n/a nM
Citation
 López-Rodríguez, MLMurcia, MBenhamú, BViso, ACampillo, MPardo, L 3-D-QSAR/CoMFA and recognition models of benzimidazole derivatives at the 5-HT(4) receptor. Bioorg Med Chem Lett 11:2807-11 (2001)  
Target
Name:
5-hydroxytryptamine receptor 4
Synonyms:
5-HT-4 5-HT4L 5-hydroxytryptamine receptor 4 Htr4 Serotonin 4 (5-HT4) receptor
Type:
Enzyme Catalytic Domain
Mol. Mass.:
46117.31
Organism:
RAT
Description:
5-HT4 HTR4 RAT::Q62758
Residue:
406
  
Inhibitor
Name:
BDBM50105635
Synonyms:
6-Chloro-1H-benzoimidazole-4-carboxylic acid [1-(2-methanesulfonylamino-ethyl)-piperidin-4-ylmethyl]-amide | CHEMBL329487
Type:
Small organic molecule
Emp. Form.:
C17H24ClN5O3S
Mol. Mass.:
413.922
SMILES:
CS(=O)(=O)NCCN1CCC(CNC(=O)c2cc(Cl)cc3nc[nH]c23)CC1
: