Target
Mitogen-activated protein kinase 14
Ligand
BDBM50072402
Substrate
Meas. Tech.
ChEBML_221157
IC50
480±n/a nM
Citation
 Adams, JLBoehm, JCGallagher, TFKassis, SWebb, EFHall, RSorenson, MGarigipati, RGriswold, DELee, JC Pyrimidinylimidazole inhibitors of p38: cyclic N-1 imidazole substituents enhance p38 kinase inhibition and oral activity. Bioorg Med Chem Lett 11:2867-70 (2001)  
Target
Name:
Mitogen-activated protein kinase 14
Synonyms:
CSAID-binding protein CSBP1 CSPB1 MAP kinase 14 MAP kinase p38 alpha MAPK14 MK14_HUMAN Mitogen-activated protein kinase p38 alpha Stress-activated protein kinase 2a | p38 MAP kinase alpha/beta
Type:
Serine/threonine-protein kinase
Mol. Mass.:
41286.76
Organism:
Homo sapiens (Human)
Description:
Q16539
Residue:
360
  
Inhibitor
Name:
BDBM50072402
Synonyms:
4-[5-(4-Fluoro-phenyl)-3-(3-morpholin-4-yl-propyl)-3H-imidazol-4-yl]-pyrimidin-2-ylamine | CHEMBL274863
Type:
Small organic molecule
Emp. Form.:
C20H23FN6O
Mol. Mass.:
382.4346
SMILES:
Nc1nccc(n1)-c1c(ncn1CCCN1CCOCC1)-c1ccc(F)cc1
: