Target
Melanocortin receptor 5
Ligand
BDBM50105890
Substrate
Meas. Tech.
ChEMBL_220876 (CHEMBL824632)
Ki
24±n/a nM
Citation
 Bednarek, MAMacNeil, TKalyani, RNTang, RVan der Ploeg, LHWeinberg, DH Selective, high affinity peptide antagonists of alpha-melanotropin action at human melanocortin receptor 4: their synthesis and biological evaluation in vitro. J Med Chem 44:3665-72 (2001)  
Target
Name:
Melanocortin receptor 5
Synonyms:
MC-2 MC5R Melanocortin MC5 Melanocortin receptor 5 | Melanocortin receptor 5 (MC5R)
Type:
Enzyme
Mol. Mass.:
36612.92
Organism:
Homo sapiens (Human)
Description:
P33032
Residue:
325
  
Inhibitor
Name:
BDBM50105890
Synonyms:
12-Amino-6-(3-guanidino-propyl)-3-(1H-indol-3-ylmethyl)-9-naphthalen-2-ylmethyl-2,5,8,11,14-pentaoxo-1,4,7,10,15pentaaza-cycloicosane-20-carboxylic acid | CHEMBL433645
Type:
Small organic molecule
Emp. Form.:
C40H51N11O6
Mol. Mass.:
781.903
SMILES:
N[C@H]1CC(=O)NCCCC[C@@H](NC(=O)[C@@H](Cc2c[nH]c3ccccc23)NC(=O)[C@H](CCCNC(N)=N)NC(=O)[C@H](Cc2ccc3ccccc3c2)NC1=O)C(N)=O
: