Target
Thrombopoietin receptor
Ligand
BDBM50105976
Substrate
Meas. Tech.
ChEMBL_207477 (CHEMBL815867)
EC50
70.0±n/a nM
Citation
 Duffy, KJDarcy, MGDelorme, EDillon, SBEppley, DFErickson-Miller, CGiampa, LHopson, CBHuang, YKeenan, RMLamb, PLeong, LLiu, NMiller, SGPrice, ATRosen, JShah, RShaw, TNSmith, HStark, KCTian, SSTyree, CWiggall, KJZhang, LLuengo, JI Hydrazinonaphthalene and azonaphthalene thrombopoietin mimics are nonpeptidyl promoters of megakaryocytopoiesis. J Med Chem 44:3730-45 (2001)  
Target
Name:
Thrombopoietin receptor
Synonyms:
C-mpl MPL TPO-R TPOR_HUMAN
Type:
PROTEIN
Mol. Mass.:
71243.48
Organism:
Homo sapiens (Human)
Description:
ChEMBL_535587
Residue:
635
  
Inhibitor
Name:
BDBM50105976
Synonyms:
3-Hydroxy-4-(1-hydroxy-naphthalen-2-ylazo)-naphthalene-1-sulfonic acid CHEMBL420168
Type:
Small organic molecule
Emp. Form.:
C20H14N2O5S
Mol. Mass.:
394.401
SMILES:
Oc1cc(c2ccccc2c1N=Nc1ccc2ccccc2c1O)S(O)(=O)=O
: