Target
cGMP-specific 3',5'-cyclic phosphodiesterase
Ligand
BDBM15336
Substrate
Meas. Tech.
ChEMBL_154563 (CHEMBL757898)
IC50
63000±n/a nM
Citation
 Lee, FYLien, JCHuang, LJHuang, TMTsai, SCTeng, CMWu, CCCheng, FCKuo, SC Synthesis of 1-benzyl-3-(5'-hydroxymethyl-2'-furyl)indazole analogues as novel antiplatelet agents. J Med Chem 44:3746-9 (2001)  
Target
Name:
cGMP-specific 3',5'-cyclic phosphodiesterase
Synonyms:
3',5'-cyclic phosphodiesterase PDE5 PDE5A_HUMAN Phosphodiesterase 5 (PDE5) Phosphodiesterase 5A (PDE5A) cGMP-specific 3',5'-cyclic phosphodiesterase
Type:
Protein
Mol. Mass.:
99975.83
Organism:
Homo sapiens (Human)
Description:
O76074
Residue:
875
  
Inhibitor
Name:
BDBM15336
Synonyms:
1-methyl-3-(2-methylpropyl)-2,3,6,7-tetrahydro-1H-purine-2,6-dione 3-Isobutyl-1-methylxanthine IBMX | isobutylmethylxanthine
Type:
Small organic molecule
Emp. Form.:
C10H14N4O2
Mol. Mass.:
222.2438
SMILES:
CC(C)Cn1c2nc[nH]c2c(=O)n(C)c1=O
: