Target
Tubulin alpha-1A chain
Ligand
BDBM50044965
Substrate
Meas. Tech.
ChEMBL_212006 (CHEMBL815106)
IC50
>40000±n/a nM
Citation
 Xia, YYang, ZYXia, PHackl, THamel, EMauger, AWu, JHLee, KH Antitumor Agents. 211. Fluorinated 2-phenyl-4-quinolone derivatives as antimitotic antitumor agents. J Med Chem 44:3932-6 (2001)  
Target
Name:
Tubulin alpha-1A chain
Synonyms:
TBA1A_PIG Tubulin Tubulin alpha-1A chain
Type:
Protein
Mol. Mass.:
50049.25
Organism:
Sus scrofa (Pig)
Description:
P02550
Residue:
451
  
Inhibitor
Name:
BDBM50044965
Synonyms:
1-Methyl-2-phenyl-1H-quinolin-4-one | CHEMBL277048
Type:
Small organic molecule
Emp. Form.:
C16H13NO
Mol. Mass.:
235.2805
SMILES:
Cn1c(cc(=O)c2ccccc12)-c1ccccc1
: