Target
Estrogen receptor
Ligand
BDBM50106646
Substrate
Meas. Tech.
ChEMBL_220736 (CHEMBL841902)
EC50
0.064±n/a nM
Citation
 Meyers, MJSun, JCarlson, KEMarriner, GAKatzenellenbogen, BSKatzenellenbogen, JA Estrogen receptor-beta potency-selective ligands: structure-activity relationship studies of diarylpropionitriles and their acetylene and polar analogues. J Med Chem 44:4230-51 (2001)  
Target
Name:
Estrogen receptor
Synonyms:
ER ESR ESR1_HUMAN Estrogen receptor Estrogen receptor (ER-alpha) Estrogen receptor alpha (ER) Nuclear receptor subfamily 3 group A member 1
Type:
Protein
Mol. Mass.:
66230.44
Organism:
Homo sapiens (Human)
Description:
P03372
Residue:
595
  
Inhibitor
Name:
BDBM50106646
Synonyms:
(S)-3-(4-Hydroxy-phenyl)-2-((R)-4-hydroxy-phenyl)-pentanenitrile CHEMBL135739
Type:
Small organic molecule
Emp. Form.:
C17H17NO2
Mol. Mass.:
267.3224
SMILES:
CC[C@@H]([C@@H](C#N)c1ccc(O)cc1)c1ccc(O)cc1
: