Target
Prothrombin
Ligand
BDBM50107062
Substrate
Meas. Tech.
ChEBML_225578
Ki
7±n/a nM
Citation
 Lévesque, SSt-Denis, YBachand, BPréville, PLeblond, LWinocour, PDEdmunds, JJRubin, JRSiddiqui, MA Novel bicyclic lactam inhibitors of thrombin: potency and selectivity optimization through P1 residues. Bioorg Med Chem Lett 11:3161-4 (2001)  
Target
Name:
Prothrombin
Synonyms:
Activated blood-coagulation factor II Activation peptide fragment 2 Blood-coagulation factor IIa E thrombin Factor IIa Gamma-thrombin THRB_RAT Thrombin Thrombin light chain Thrombofort | Tropostasin
Type:
Protein
Mol. Mass.:
70413.05
Organism:
Rattus norvegicus
Description:
P18292
Residue:
617
  
Inhibitor
Name:
BDBM50107062
Synonyms:
(6S,8aS)-4-Oxo-2-phenylmethanesulfonyl-octahydro-pyrrolo[1,2-a]pyrazine-6-carboxylic acid 4-carbamimidoyl-2-methyl-benzylamide | CHEMBL110237
Type:
Small organic molecule
Emp. Form.:
C24H29N5O4S
Mol. Mass.:
483.583
SMILES:
Cc1cc(ccc1CNC(=O)[C@@H]1CC[C@H]2CN(CC(=O)N12)S(=O)(=O)Cc1ccccc1)C(N)=N
: