Target
Integrin alpha-L
Ligand
BDBM50092956
Substrate
Meas. Tech.
ChEMBL_88940 (CHEMBL699112)
IC50
44±n/a nM
Citation
 Winn, MReilly, EBLiu, GHuth, JRJae, HSFreeman, JPei, ZXin, ZLynch, JKester, Jvon Geldern, TWLeitza, SDeVries, PDickinson, RMussatto, DOkasinski, GF Discovery of novel p-arylthio cinnamides as antagonists of leukocyte function-associated antigen-1/intercellular adhesion molecule-1 interaction. 4. Structure-activity relationship of substituents on the benzene ring of the cinnamide. J Med Chem 44:4393-403 (2001)  
Target
Name:
Integrin alpha-L
Synonyms:
CD11 antigen-like family member A CD_antigen=CD11a ITGAL LFA-1A Leukocyte adhesion glycoprotein LFA-1 alpha chain | Leukocyte function-associated molecule 1 alpha chain
Type:
PROTEIN
Mol. Mass.:
128748.90
Organism:
Homo sapiens (Human)
Description:
ChEMBL_629045
Residue:
1170
  
Inhibitor
Name:
BDBM50092956
Synonyms:
1-(4-Acetyl-piperazin-1-yl)-3-[4-(2-isopropyl-phenylsulfanyl)-3-nitro-phenyl]-propenone A-286982 | CHEMBL19677
Type:
Small organic molecule
Emp. Form.:
C24H27N3O4S
Mol. Mass.:
453.554
SMILES:
CC(C)c1ccccc1Sc1ccc(\C=C\C(=O)N2CCN(CC2)C(C)=O)cc1[N+]([O-])=O
: