Target
Cathepsin B
Ligand
BDBM50107639
Substrate
Meas. Tech.
ChEMBL_47411 (CHEMBL657288)
IC50
2±n/a nM
Citation
 Greenspan, PDClark, KLTommasi, RACowen, SDMcQuire, LWFarley, DLvan Duzer, JHGoldberg, RLZhou, HDu, ZFitt, JJCoppa, DEFang, ZMacchia, WZhu, LCapparelli, MPGoldstein, RWigg, AMDoughty, JRBohacek, RSKnap, AK Identification of dipeptidyl nitriles as potent and selective inhibitors of cathepsin B through structure-based drug design. J Med Chem 44:4524-34 (2001)  
Target
Name:
Cathepsin B
Synonyms:
APP secretase CATB_HUMAN CTSB Cathepsin B light chain | Cathepsin B1
Type:
Enzyme
Mol. Mass.:
37819.69
Organism:
Homo sapiens (Human)
Description:
gi_63102437
Residue:
339
  
Inhibitor
Name:
BDBM50107639
Synonyms:
3-{2-[2-(4-Chloro-2-fluoro-benzoylamino)-3-m-tolyl-propionylamino]-2-cyano-ethoxymethyl}-benzoic acid | CHEMBL138499
Type:
Small organic molecule
Emp. Form.:
C28H25ClFN3O5
Mol. Mass.:
537.967
SMILES:
Cc1cccc(C[C@H](NC(=O)c2ccc(Cl)cc2F)C(=O)N[C@@H](COCc2cccc(c2)C(O)=O)C#N)c1
: